{"text_format":"1","workbook":"xlsx","n_sheets":23,"sheets":["Cover Page","Institution_Codes","General Instructions","ASCII","Summary LCR","1.HQLA","2.Outflows","3.Inflows","4.LCR calculation","5.HQLA-TTD","6.Outflows-TTD","7.Inflows-TTD","8.LCR Calculation-TTD","9.HQLA-SC1","10.Outflows-SC1","11.Inflows-SC1","12.LCR calculation-SC1","13. HQLA-SC2","14.Outflows-SC2","15.Inflows-SC2","16.LCR calculation-SC2","Signature","Validations"],"not_rendered":{"charts":0,"images":1,"macros":1,"external_links":5,"defined_names":489,"comments":0,"pivot_tables":0},"unopened":[],"bounds":{"document_bytes":16777216,"sheet_cells":100000,"rows_first":2000,"rows_last":500,"rows_between":2000,"halvings":0,"cell_chars":16384,"cell_head_chars":4096},"cells_cut":0,"cells_raw":0,"read":"whole","date_system":"1900"}

{"sheet":"Cover Page","index":0,"n_rows":13,"n_cols":11,"rows_kept":13,"cut":false,"hidden":false,"merged":[[10,2,10,9],[11,4,11,7],[12,4,12,7],[3,2,3,9],[4,2,4,9],[6,2,6,9],[7,2,7,9],[9,5,9,6],[1,2,1,9],[2,2,2,9],[5,2,5,9],[8,2,8,4],[8,5,8,6],[8,7,8,9]]}
[]
[null,null,"CENTRAL BANK OF TRINIDAD AND TOBAGO "]
[null,null,"V1.1"]
[null,null,"CB120LCR - LIQUIDITY COVERAGE RATIO RETURN"]
[null,null,"Date Issued : 10/02/2025"]
[null,null,"FOR "]
[null,null,"Select Institution",null,null,null,null,null,null,null,{"$f":"VLOOKUP($C$7,Institution_Codes!$A$2:$B$35,2,FALSE)","v":{"$error":"#N/A"}}]
[null,null,"For the Month Ended:"]
[null,null,"Month ",null,null,"Month"]
[null,null,null,null,"Year",2025]
{"$rows_left_out":4}
{"sheet":"Institution_Codes","index":1,"n_rows":35,"n_cols":9,"rows_kept":35,"cut":false,"hidden":true,"merged":[]}
["Select Institution","-",null,"Month",null,null,null,"Year"]
["ANSA Bank Limited","BBDA",null,"January",1,null,null,2023,23]
["ANSA Merchant Bank Limited","AMAL",null,"February",2,null,null,2024,24]
["ANSA Merchant Bank Limited Consolidated","AMAL_CONS",null,"March",3,null,null,2025,25]
["Caribbean Finance Company Limited","CFC",null,"April",4,null,null,2026,26]
["CIBC Caribbean Bank (Trinidad and Tobago) Limited","FCIB",null,"May",5,null,null,2027,27]
["Citibank (Trinidad & Tobago) Limited","CITI",null,"June",6,null,null,2028,28]
["Citicorp Merchant Bank Limited","CMBL",null,"July",7,null,null,2029,29]
["Citicorp Merchant Bank Limited Consolidated","CMBL_CONS",null,"August",8,null,null,2030,30]
["Development Finance Limited","DFL",null,"September",9,null,null,2031,31]
{"$rows_left_out":26}
{"sheet":"General Instructions","index":2,"n_rows":26,"n_cols":2,"rows_kept":26,"cut":false,"hidden":false,"merged":[]}
[null,"CB120LCR Return"]
[null,"Please use the CB120LCR instructions to complete the return using the link below. "]
[null,"CB120LCR Instructions"]
[]
[null,"GENERAL INSTRUCTIONS"]
[1,"Do not amend the structure/format."]
[2,"Do not remove the password protection."]
[3,"Do not manipulate the formulas."]
[4,"Complete Cover Page before submission. \nInstitution, reporting month and date submitted must be populated. "]
[5,"No blank cells.  All cells must be populated with zero where there is no data."]
{"$rows_left_out":17}
{"sheet":"ASCII","index":3,"n_rows":1212,"n_cols":10,"rows_kept":1212,"cut":false,"hidden":true,"merged":[]}
[null,{"$f":"VLOOKUP('Cover Page'!$C$7,Institution_Codes!$A$1:$B$35,2,)","v":"-"}]
[{"$f":"VLOOKUP('Cover Page'!F9,Institution_Codes!D2:E13,2,FALSE)","v":{"$error":"#N/A"}}]
[{"$f":"VLOOKUP('Cover Page'!F10,Institution_Codes!H2:I44,2,)","v":25}]
[]
[".AGG.HQLA.MVTT.1.111",{"$f":"ROUND('1.HQLA'!C10,5)","v":0}]
[".AGG.HQLA.MVTT.1.112",{"$f":"ROUND('1.HQLA'!C11,5)","v":0}]
[".AGG.HQLA.MVTT.1.113",{"$f":"ROUND('1.HQLA'!C12,5)","v":0}]
[".AGG.HQLA.MVTT.1.114",{"$f":"ROUND('1.HQLA'!C13,5)","v":0}]
[".AGG.HQLA.MVTT.1.1151",{"$f":"ROUND('1.HQLA'!C15,5)","v":0}]
[".AGG.HQLA.MVTT.1.1152",{"$f":"ROUND('1.HQLA'!C16,5)","v":0}]
{"$rows_left_out":1203}
{"sheet":"Summary LCR","index":4,"n_rows":8,"n_cols":6,"rows_kept":8,"cut":false,"hidden":false,"merged":[]}
["Liquidity Coverage Ratio (LCR) "]
["SUMMARY SHEET"]
[]
["LIQUIDITY COVERAGE RATIOS","CURRENCY","HQLA","OUTFLOWS","INFLOWS","LIQUIDITY COVERAGE RATIO"]
["LCR (all currencies in aggregate)","Aggregate",{"$f":"'1.HQLA'!E38","v":0},{"$f":"'2.Outflows'!E94","v":0},{"$f":"'3.Inflows'!E32","v":0},{"$f":"'4.LCR calculation'!C33","v":0}]
["LCR - TTD",{"$f":"'5.HQLA-TTD'!D2","v":"TTD"},{"$f":"'5.HQLA-TTD'!E38","v":0},{"$f":"'6.Outflows-TTD'!E94","v":0},{"$f":"'7.Inflows-TTD'!E32","v":0},{"$f":"'8.LCR Calculation-TTD'!C33","v":0}]
["LCR - SC1",{"$f":"'9.HQLA-SC1'!D2","v":0},{"$f":"'9.HQLA-SC1'!G38","v":0},{"$f":"'10.Outflows-SC1'!G94","v":0},{"$f":"'11.Inflows-SC1'!G32","v":0},{"$f":"'12.LCR calculation-SC1'!C33","v":0}]
["LCR - SC2",{"$f":"'13. HQLA-SC2'!D2","v":0},{"$f":"'13. HQLA-SC2'!G38","v":0},{"$f":"'14.Outflows-SC2'!G94","v":0},{"$f":"'15.Inflows-SC2'!G32","v":0},{"$f":"'16.LCR calculation-SC2'!C33","v":0}]

{"sheet":"1.HQLA","index":5,"n_rows":38,"n_cols":6,"rows_kept":38,"cut":false,"hidden":false,"merged":[[35,1,35,3],[36,1,36,3]]}
["Liquidity Coverage Ratio (LCR) "]
["All items reported in thousand of TT dollars. Separate worksheets are required for each significant currency"]
["Insert data in the white cells only"]
["TT$'000"]
[]
["1. Stock of high quality liquid assets (HQLA)"]
[]
["Reference","Item","Market Value (TT$'000)","Weight","Weighted Amount (TT$'000)","LCR Guideline Reference -Section:"]
["1.1. Level 1 assets"]
[111,"Coins and banknotes (including qualifying cash items in the process of collection)",null,1,{"$f":"C10*D10","v":0},6.17]
{"$rows_left_out":29}
{"sheet":"2.Outflows","index":6,"n_rows":94,"n_cols":6,"rows_kept":94,"cut":false,"hidden":false,"merged":[]}
["Liquidity Coverage Ratio (LCR)"]
["All items reported in thousand of TT dollars. A separate worksheet is required  for each significant currency"]
["Insert data in the white cells only"]
["TT$'000"]
[]
["2. Cash outflows"]
["Reference","Item","Amount (TT$'000)","Outflow rate","Cash Outflows","LCR Guideline Reference - Section:"]
["2.1. Retail deposit run-off"]
[211,"Retail Term Deposits with residual maturity or withdrawal notice period > 30 days",null,0,{"$f":"C9*D9","v":0},7.17]
[212,"Stable Retail deposits",null," "]
{"$rows_left_out":85}
{"sheet":"3.Inflows","index":7,"n_rows":32,"n_cols":6,"rows_kept":32,"cut":false,"hidden":false,"merged":[]}
["Liquidity Coverage Ratio (LCR)"]
["All items reported in thousand of TT dollars. A separate worksheet is required  for each significant currency"]
["Insert data in the white cells only"]
["TT$'000"]
[]
["3. Cash Inflows"]
["Reference","Item","Amount (TT$'000)","Inflow rate","Cash Inflows","LCR Guideline Reference - Section:"]
["3.1. Secured Lending "]
[311,"Maturing secured lending transactions backed by the following collateral:"]
[3111,"Level 1 assets",null,0,{"$f":"C10*D10","v":0},"8.4 a."]
{"$rows_left_out":23}
{"sheet":"4.LCR calculation","index":8,"n_rows":33,"n_cols":3,"rows_kept":33,"cut":false,"hidden":false,"merged":[]}
["Liquidity Coverage Ratio (LCR)"]
["All items reported in thousand of TT dollars. A separate worksheet is required  for each significant currency"]
["TT$'000"]
[]
["4. The LCR calculation"]
["Reference","Item","Amount (TT$'000)"]
["4.1. HQLAs"]
[411,"Level 1 Assets",{"$f":"'1.HQLA'!E22","v":0}]
[{"$f":"A8+1","v":412},"Level 2 Assets",{"$f":"C10+C11","v":0}]
[413,"Level 2A Assets",{"$f":"'1.HQLA'!E30","v":0}]
{"$rows_left_out":24}
{"sheet":"5.HQLA-TTD","index":9,"n_rows":38,"n_cols":6,"rows_kept":38,"cut":false,"hidden":false,"merged":[[35,1,35,3],[36,1,36,3]]}
["Liquidity Coverage Ratio (LCR) "]
["Significant Currency - TTD",null,"Significant Currency Type:","TTD"]
["Separate worksheets are required for each significant currency"]
["Insert data in the white cells only"]
["TT$'000"]
["1. Stock of high quality liquid assets (HQLA)"]
[]
["Reference","Item","Market Value TT$'000 ","Weight","Weighted Amount (TT$'000)","LCR Guideline Reference -Section:"]
["1.1. Level 1 assets"]
[111,"Coins and banknotes (including qualifying cash items in the process of collection)",0,1,{"$f":"C10*D10","v":0},6.17]
{"$rows_left_out":29}
{"sheet":"6.Outflows-TTD","index":10,"n_rows":94,"n_cols":6,"rows_kept":94,"cut":false,"hidden":false,"merged":[]}
["Liquidity Coverage Ratio (LCR)"]
["Significant Currency - TTD",null,"Significant Currency Type:","TTD"]
[" Separate worksheets are required for each significant currency"]
["Insert data in the white cells only"]
["TT$'000"]
["2. Cash outflows"]
["Reference","Item","Amount TT$'000 ","Outflow rate","Cash Outflows","LCR Guideline Reference - Section:"]
["2.1. Retail deposit run-off"]
[211,"Retail Term Deposits with residual maturity or withdrawal notice period > 30 days",0,0,{"$f":"C9*D9","v":0},7.17]
[212,"Stable Retail deposits",null," "]
{"$rows_left_out":85}
{"sheet":"7.Inflows-TTD","index":11,"n_rows":32,"n_cols":6,"rows_kept":32,"cut":false,"hidden":false,"merged":[]}
["Liquidity Coverage Ratio (LCR)"]
["Significant Currency - TTD",null,"Significant Currency Type:","TTD"]
["A separate worksheet is required  for each significant currency"]
["Insert data in the white cells only"]
["TT$'000"]
["3. Cash Inflows"]
["Reference","Item","Amount TT$'000 ","Inflow rate","Cash Inflows","LCR Guideline Reference - Section:"]
["3.1. Secured Lending "]
[311,"Maturing secured lending transactions backed by the following collateral:"]
[3111,"Level 1 assets",0,0,{"$f":"C10*D10","v":0},"8.4 a."]
{"$rows_left_out":23}
{"sheet":"8.LCR Calculation-TTD","index":12,"n_rows":33,"n_cols":4,"rows_kept":33,"cut":false,"hidden":false,"merged":[]}
["Liquidity Coverage Ratio (LCR)"]
["Significant Currency - TTD",null,"Significant Currency Type:","TTD"]
[" A separate worksheet is required  for each significant currency"]
["TT$'000"]
["4. The LCR calculation"]
["Reference","Item","Amount (TT$'000)"]
["4.1. HQLAs"]
[411,"Level 1 Assets",{"$f":"'5.HQLA-TTD'!E22","v":0}]
[{"$f":"A8+1","v":412},"Level 2 Assets",{"$f":"C10+C11","v":0}]
[413,"Level 2A Assets",{"$f":"'5.HQLA-TTD'!E30","v":0}]
{"$rows_left_out":24}
{"sheet":"9.HQLA-SC1","index":13,"n_rows":38,"n_cols":8,"rows_kept":38,"cut":false,"hidden":false,"merged":[[35,1,35,5],[36,1,36,5]]}
["Liquidity Coverage Ratio (LCR) "]
["Significant Foreign Currency 1 (SC1)",null,"Significant Currency Type:"]
["Separate worksheets are required for each significant currency"]
["Insert data in the white cells only"]
["TT$'000"]
["1. Stock of high quality liquid assets (HQLA)"]
[]
["Reference","Item","Market Value ($'000) in foreign currency","Exchange rate","Market Value - In TT$'000 equivalent","Weight","Weighted Amount (TT$'000)","LCR Guideline Reference -Section:"]
["1.1. Level 1 assets"]
[111,"Coins and banknotes (including qualifying cash items in the process of collection)",null,null,{"$f":"C10*$D$9","v":0},1,{"$f":"E10*F10","v":0},6.17]
{"$rows_left_out":29}
{"sheet":"10.Outflows-SC1","index":14,"n_rows":94,"n_cols":8,"rows_kept":94,"cut":false,"hidden":false,"merged":[]}
["Liquidity Coverage Ratio (LCR)"]
["Significant Foreign Currency 1 (SC1)",null,"Significant Currency Type:",{"$f":"'9.HQLA-SC1'!D2","v":0}]
[" Separate worksheets are required for each significant currency"]
["Insert data in the white cells only"]
["TT$'000"]
["2. Cash outflows"]
["Reference","Item","Amount ($'000) in foreign currency","Exchange Rate","Amount in TT$'000 equivalent","Outflow rate","Cash Outflows","LCR Guideline Reference - Section:"]
["2.1. Retail deposit run-off"]
[211,"Retail Term Deposits with residual maturity or withdrawal notice period > 30 days",null,null,{"$f":"C9*$D$8","v":0},0,{"$f":"E9*F9","v":0},7.17]
[212,"Stable Retail deposits",null,null,null," "]
{"$rows_left_out":85}
{"sheet":"11.Inflows-SC1","index":15,"n_rows":32,"n_cols":8,"rows_kept":32,"cut":false,"hidden":false,"merged":[]}
["Liquidity Coverage Ratio (LCR)"]
["Significant Foreign Currency 1 (SC1)",null,"Significant Currency Type:",{"$f":"'9.HQLA-SC1'!D2","v":0}]
["A separate worksheet is required  for each significant currency"]
["Insert data in the white cells only"]
["TT$'000"]
["3. Cash Inflows"]
["Reference","Item","Amount ($'000) in foreign currency","Exchange rate","Amount in TT$'000 equivalent","Inflow rate","Cash Inflows","LCR Guideline Reference - Section:"]
["3.1. Secured Lending "]
[311,"Maturing secured lending transactions backed by the following collateral:"]
[3111,"Level 1 assets",null,null,{"$f":"C10*$D$8","v":0},0,{"$f":"E10*F10","v":0},"8.4 a."]
{"$rows_left_out":23}
{"sheet":"12.LCR calculation-SC1","index":16,"n_rows":33,"n_cols":4,"rows_kept":33,"cut":false,"hidden":false,"merged":[]}
["Liquidity Coverage Ratio (LCR)"]
["Significant Foreign Currency 1 (SC1)",null,"Significant Currency Type:",{"$f":"'9.HQLA-SC1'!D2","v":0}]
[" A separate worksheet is required  for each significant currency"]
["TT$'000"]
["4. The LCR calculation"]
["Reference","Item","Amount (TT$'000)"]
["4.1. HQLAs"]
[411,"Level 1 Assets",{"$f":"'9.HQLA-SC1'!G22","v":0}]
[{"$f":"A8+1","v":412},"Level 2 Assets",{"$f":"C10+C11","v":0}]
[413,"Level 2A Assets",{"$f":"'9.HQLA-SC1'!G30","v":0}]
{"$rows_left_out":24}
{"sheet":"13. HQLA-SC2","index":17,"n_rows":38,"n_cols":8,"rows_kept":38,"cut":false,"hidden":false,"merged":[[35,1,35,5],[36,1,36,5]]}
["Liquidity Coverage Ratio (LCR) "]
["Significant Foreign Currency 2 (SC2)",null,"Significant Currency Type:"]
["Separate worksheets are required for each significant currency"]
["Insert data in the white cells only"]
["TT$'000"]
["1. Stock of high quality liquid assets (HQLA)"]
[]
["Reference","Item","Market Value ($'000) in foreign currency","Exchange rate","Market Value - In TT$'000 equivalent","Weight","Weighted Amount (TT$'000)","LCR Guideline Reference -Section:"]
["1.1. Level 1 assets"]
[111,"Coins and banknotes (including qualifying cash items in the process of collection)",null,null,{"$f":"C10*$D$9","v":0},1,{"$f":"E10*F10","v":0},6.17]
{"$rows_left_out":29}
{"sheet":"14.Outflows-SC2","index":18,"n_rows":94,"n_cols":8,"rows_kept":94,"cut":false,"hidden":false,"merged":[]}
["Liquidity Coverage Ratio (LCR)"]
["Significant Foreign Currency 2 (SC2)",null,"Significant Currency Type:",{"$f":"'13. HQLA-SC2'!D2","v":0}]
[" Separate worksheets are required for each significant currency"]
["Insert data in the white cells only"]
["TT$'000"]
["2. Cash outflows"]
["Reference","Item","Amount ($'000) in foreign currency","Exchange Rate","Amount in TT$'000 equivalent","Outflow rate","Cash Outflows","LCR Guideline Reference - Section:"]
["2.1. Retail deposit run-off"]
[211,"Retail Term Deposits with residual maturity or withdrawal notice period > 30 days",null,null,{"$f":"C9*$D$8","v":0},0,{"$f":"E9*F9","v":0},7.17]
[212,"Stable Retail deposits",null,null,null," "]
{"$rows_left_out":85}
{"sheet":"15.Inflows-SC2","index":19,"n_rows":32,"n_cols":8,"rows_kept":32,"cut":false,"hidden":false,"merged":[]}
["Liquidity Coverage Ratio (LCR)"]
["Significant Foreign Currency 2 (SC2)",null,"Significant Currency Type:",{"$f":"'13. HQLA-SC2'!D2","v":0}]
["A separate worksheet is required  for each significant currency"]
["Insert data in the white cells only"]
["TT$'000"]
["3. Cash Inflows"]
["Reference","Item","Amount ($'000) in foreign currency","Exchange rate","Amount in TT$'000 equivalent","Inflow rate","Cash Inflows","LCR Guideline Reference - Section:"]
["3.1. Secured Lending "]
[311,"Maturing secured lending transactions backed by the following collateral:"]
[3111,"Level 1 assets",null,null,{"$f":"C10*$D$8","v":0},0,{"$f":"E10*F10","v":0},"8.4 a."]
{"$rows_left_out":23}
{"sheet":"16.LCR calculation-SC2","index":20,"n_rows":33,"n_cols":4,"rows_kept":33,"cut":false,"hidden":false,"merged":[]}
["Liquidity Coverage Ratio (LCR)"]
["Significant Foreign Currency 2 (SC2)",null,"Significant Currency Type:",{"$f":"'13. HQLA-SC2'!D2","v":0}]
[" A separate worksheet is required  for each significant currency"]
["TT$'000"]
["4. The LCR calculation"]
["Reference","Item","Amount (TT$'000)"]
["4.1. HQLAs"]
[411,"Level 1 Assets",{"$f":"'13. HQLA-SC2'!G22","v":0}]
[{"$f":"A8+1","v":412},"Level 2 Assets",{"$f":"C10+C11","v":0}]
[413,"Level 2A Assets",{"$f":"'13. HQLA-SC2'!G30","v":0}]
{"$rows_left_out":24}
{"sheet":"Signature","index":21,"n_rows":31,"n_cols":4,"rows_kept":31,"cut":false,"hidden":false,"merged":[]}
[]
[]
[]
[]
[]
[null,"Name of Person Completing Form ",null,"Signature of Person Completing Form "]
[null,"(Block Letters)"]
[]
[]
[]
{"$rows_left_out":22}
{"sheet":"Validations","index":22,"n_rows":807,"n_cols":9,"rows_kept":807,"cut":false,"hidden":false,"merged":[[1,8,1,12]]}
["Liquidity Coverage Ratio Return – Basel III",null,null,null,null,"FALSE COUNT","Date Check",{"$f":"(TEXT(MID(RIGHT(MID(CELL(\"filename\",'Cover Page'!A1),FIND(\"[\",CELL(\"filename\",'Cover Page'!A1))+1,FIND(\"]\", CELL(\"filename\",'Cover Page'!A1))-FIND(\"[\",CELL(\"filename\",'Cover Page'!A1))-1),LEN(MID(CELL(\"filename\",'Cover Page'!A1),FIND(\"[\",CELL(\"filename\",'Cover Page'!A1))+1,FIND(\"]\", CELL(\"filename\",'Cover Page'!A1))-FIND(\"[\",CELL(\"filename\",'Cover Page'!A1))-1))-FIND(\"~\",SUBSTITUTE(MID(CELL(\"filename\",'Cover Page'!A1),FIND(\"[\",CELL(\"filename\",'Cover Page'!A1))+1,FIND(\"]\", CELL(\"filename\",'Cover Page'!A1))-FIND(\"[\",CELL(\"filename\",'Cover Page'!A1))-1),\"_\",\"~\",3))),1,7),\"yyyy-MM-dd\"))=(TEXT(TEXT(DATE('Cover Page'!F10,MONTH(DATEVALUE('Cover Page'!F9 & 1)),\"1\"),\"MMM-YYYY\"),\"yyyy-MM-dd\"))","v":{"$error":"#VALUE!"}},{"$f":"COUNTIF(Institution_Codes!$B$2:$B$35,'Cover Page'!$K$7)","v":0}]
["Set of rules ID/Description","Rule type","Text rule","Description","Rule ID",{"$f":"COUNTIF(F4:F807,FALSE) +COUNTIF($H$1,FALSE)+COUNTIF($I$1,0)","v":1},"Name Check",{"$f":"IF($I$1=0,\"FALSE\",\"TRUE\")","v":"FALSE"},{"$f":"IF($I$1=0,\"Please select your institution on the Cover Page.\",\"\")","v":"Please select your institution on the Cover Page."}]
["Schedule 1 - HQLA"]
["Coins and banknotes (including qualifying cash items in the process of collection)","In-schedule","S01.DP01*1=S01.DP21","1.HQLA!C10*1.HQLA!D10=1.HQLA!E10",1,{"$f":"IF(('1.HQLA'!C10*'1.HQLA'!D10='1.HQLA'!E10),TRUE,FALSE)","v":true}]
["Eligible Reserves held at Central Banks","In-schedule","S01.DP02*1=S01.DP22","1.HQLA!C11*1.HQLA!D11=1.HQLA!E11",{"$f":"E4+1","v":2},{"$f":"IF(('1.HQLA'!C11*'1.HQLA'!D11='1.HQLA'!E11),TRUE,FALSE)","v":true}]
["Securities issued or guaranteed by the government of Trinidad and Tobago ","In-schedule","S01.DP03*1=S01.DP23","1.HQLA!C12*1.HQLA!D12=1.HQLA!E12",{"$f":"E5+1","v":3},{"$f":"IF(('1.HQLA'!C12*'1.HQLA'!D12='1.HQLA'!E12),TRUE,FALSE)","v":true}]
["Securities issued or guaranteed by the Central Bank of Trinidad and Tobago ","In-schedule","S01.DP04*1=S01.DP24","1.HQLA!C13*1.HQLA!D13=1.HQLA!E13",{"$f":"E6+1","v":4},{"$f":"IF(('1.HQLA'!C13*'1.HQLA'!D13='1.HQLA'!E13),TRUE,FALSE)","v":true}]
["Other eligible securities with a 0% risk weight: Issued or guaranteed by sovereigns","In-schedule","S01.DP05*1=S01.DP25","1.HQLA!C15*1.HQLA!D15=1.HQLA!E15",{"$f":"E7+1","v":5},{"$f":"IF(('1.HQLA'!C15*'1.HQLA'!D15='1.HQLA'!E15),TRUE,FALSE)","v":true}]
["Other eligible securities with a 0% risk weight: Issued or guaranteed by central banks","In-schedule","S01.DP06*1=S01.DP26","1.HQLA!C16*1.HQLA!D16=1.HQLA!E16",6,{"$f":"IF(('1.HQLA'!C16*'1.HQLA'!D16='1.HQLA'!E16),TRUE,FALSE)","v":true}]
["Other eligible securities with a 0% risk weight: Issued or guaranteed by PSEs","In-schedule","S01.DP07*1=S01.DP27","1.HQLA!C17*1.HQLA!D17=1.HQLA!E17",7,{"$f":"IF(('1.HQLA'!C17*'1.HQLA'!D17='1.HQLA'!E17),TRUE,FALSE)","v":true}]
{"$rows_left_out":797}