{"text_format":"1","workbook":"xlsx","n_sheets":11,"sheets":["COVER PAGE","Navigate","General Instructions","Repricing&Maturity","Maturity","Private Sector PDLs by Sector","Public Sector PDLs by Sector","Consumer PDLs by Purpose","ascii","Codes","SIGNATURE "],"not_rendered":{"charts":0,"images":5,"macros":1,"external_links":5,"defined_names":325,"comments":2,"pivot_tables":0},"unopened":[],"bounds":{"document_bytes":16777216,"sheet_cells":100000,"rows_first":2000,"rows_last":500,"rows_between":2000,"halvings":0,"cell_chars":16384,"cell_head_chars":4096},"cells_cut":0,"cells_raw":0,"read":"whole","date_system":"1900"}

{"sheet":"COVER PAGE","index":0,"n_rows":13,"n_cols":6,"rows_kept":13,"cut":false,"hidden":false,"merged":[[1,2,1,9],[8,2,8,4],[8,7,8,9],[4,2,4,9],[3,2,3,9],[2,2,2,9],[6,2,6,9],[5,2,5,9],[12,5,12,6],[8,5,8,6],[7,2,7,9],[9,2,9,4],[11,4,11,7],[9,5,9,6],[10,2,10,9]]}
[]
[null,null,"CENTRAL BANK OF TRINIDAD AND TOBAGO "]
[]
[null,null,"Stress Testing - Special Data Requirements"]
[null,null,"V1.1"]
[null,null,"FOR "]
[null,null,"        Select Institution"]
[null,null,"For the Quarter Ended:"]
[null,null,"Month",null,null,"Select Month"]
[null,null,"Year",null,null,"Select Year"]
[null,null,"Date Submitted:"]
[]
[null,null,null,null,null,"mm/dd/yyyy"]

{"sheet":"Navigate","index":1,"n_rows":25,"n_cols":7,"rows_kept":25,"cut":false,"hidden":true,"merged":[[20,2,20,6],[6,2,6,6],[5,2,5,6],[14,2,14,6],[22,2,22,6],[21,2,21,6],[17,2,17,6]]}
[]
[]
[]
[]
[]
[null,null,"Stress Testing the Commercial Banking System in Trinidad and Tobago"]
[null,null,"Special Data Requirements"]
[]
[null,null,null,"Month","Year"]
[null,null,"Period","Mar",2021]
[]
[null,null,"Bank Name",null,"JMMB Bank (T&T) Limited ",null,{"$f":"IF(E12=\"ANSA Bank Limited\",\"BBDA\",IF(E12=\"Citibank (Trinidad & Tobago) Limited\",\"CITI\",IF(E12=\"FirstCaribbean International Bank (Trinidad & Tobago) Limited \",\"FCIB\",IF(E12=\"First Citizens Bank Limited \",\"FCB\",IF(E12=\"JMMB Bank (T&T) Limited \",\"ICBL\",IF(E12=\"RBC Royal Bank (Trinidad and Tobago) Limited\",\"RBTT\",IF(E12=\"Republic Bank Limited \",\"RBL\",IF(E12=\"Scotiabank Trinidad and Tobago Limited \",\"BNS\",\"\"))))))))","v":"ICBL"}]
[]
[null,null,"Interest Rate Risk"]
[null,null,"Asset & Liability Repricing/Maturity Schedule"]
[]
[null,null,"Liquidity Risk"]
[null,null,"Asset & Liability Maturity Schedule"]
[]
[null,null,"Credit Risk"]
{"$rows_left_out":6}
{"sheet":"General Instructions","index":2,"n_rows":17,"n_cols":2,"rows_kept":17,"cut":false,"hidden":false,"merged":[]}
[null,"Stress Testing - Special Data Requirements"]
[null,"Stress Testing Instructions"]
[]
[null,"GENERAL INSTRUCTIONS"]
[1,"Do not amend the structure/format."]
[2,"Do not remove the password protection."]
[3,"Do not manipulate the formulas."]
[4,"Complete Cover Page before submission. \nInstitution, reporting month, reporting year and date submitted must be populated. "]
[5,"No blank cells.  All cells must be populated with zero where there is no data."]
[6,"N/A, N/D, NA/ND CANNOT be used anywhere in this return."]
[7,"Do not use text except in the Assumption column for the tabs “Repricing&Maturity” and “Maturity”."]
[8,"Do not use symbols in cells (<, >, commas, full stops, apostrophe, tilde etc.)."]
[9,"Select the \"Break Links and Save\" button on the \"COVER PAGE\" tab to save the \".xlsx\" version for submission.  Ensure when links are broken the files are checked for text references which have to be deleted/amended (#Ref, FALSE! etc.) prior to submission."]
[]
[null,"FILE NAMING FOR SUBMISSION"]
[10,"Use the name file structure \"Company Code_STRESSTEST_V1.1_MMMYYYY\". Note all files sent to institutions will have the company code. "]
[11,"Resubmissions must have the same file name structure as listed"]

{"sheet":"Repricing&Maturity","index":3,"n_rows":51,"n_cols":13,"rows_kept":51,"cut":false,"hidden":false,"merged":[[1,0,1,12],[4,2,4,6],[3,2,3,6],[7,2,7,11],[5,2,5,6]]}
[]
["Asset and Liability Maturity/Repricing Schedule\n- Interest Rate Risk -"]
[]
[null,"Name of Institution:",{"$f":"'COVER PAGE'!C7","v":"        Select Institution"}]
[null,"Institution Code:",{"$f":"IF(C4=\"ANSA Bank Limited\",\"BBDA\",IF(C4=\"Citibank (Trinidad & Tobago) Limited\",\"CITI\",IF(C4=\"CIBC Caribbean Bank (Trinidad and Tobago) Limited \",\"FCIB\",IF(C4=\"First Citizens Bank Limited \",\"FCB\",IF(C4=\"JMMB Bank (T&T) Limited \",\"ICBL\",IF(C4=\"RBC Royal Bank (Trinidad and Tobago) Limited\",\"RBTT\",IF(C4=\"Republic Bank Limited \",\"RBL\",IF(C4=\"Scotiabank Trinidad and Tobago Limited \",\"BNS\",\"\"))))))))","v":""},{"$f":"IF(B5=\"ANSA Bank Limited\",\"BBDA\",IF(B5=\"Citibank (Trinidad & Tobago) Limited\",\"CITI\",IF(B5=\"FirstCaribbean International Bank (Trinidad & Tobago) Limited \",\"FCIB\",IF(B5=\"First Citizens Bank Limited \",\"FCB\",IF(B5=\"JMMB Bank (T&T) Limited \",\"ICBL\",IF(B5=\"RBC Royal Bank (Trinidad and Tobago) Limited\",\"RBTT\",IF(B5=\"Republic Bank Limited \",\"RBL\",IF(B5=\"Scotiabank Trinidad and Tobago Limited \",\"BNS\",\"\"))))))))","v":""},{"$f":"IF(C5=\"ANSA Bank Limited\",\"BBDA\",IF(C5=\"Citibank (Trinidad & Tobago) Limited\",\"CITI\",IF(C5=\"FirstCaribbean International Bank (Trinidad & Tobago) Limited \",\"FCIB\",IF(C5=\"First Citizens Bank Limited \",\"FCB\",IF(C5=\"JMMB Bank (T&T) Limited \",\"ICBL\",IF(C5=\"RBC Royal Bank (Trinidad and Tobago) Limited\",\"RBTT\",IF(C5=\"Republic Bank Limited \",\"RBL\",IF(C5=\"Scotiabank Trinidad and Tobago Limited \",\"BNS\",\"\"))))))))","v":""},{"$f":"IF(D5=\"ANSA Bank Limited\",\"BBDA\",IF(D5=\"Citibank (Trinidad & Tobago) Limited\",\"CITI\",IF(D5=\"FirstCaribbean International Bank (Trinidad & Tobago) Limited \",\"FCIB\",IF(D5=\"First Citizens Bank Limited \",\"FCB\",IF(D5=\"JMMB Bank (T&T) Limited \",\"ICBL\",IF(D5=\"RBC Royal Bank (Trinidad and Tobago) Limited\",\"RBTT\",IF(D5=\"Republic Bank Limited \",\"RBL\",IF(D5=\"Scotiabank Trinidad and Tobago Limited \",\"BNS\",\"\"))))))))","v":""},{"$f":"IF(E5=\"ANSA Bank Limited\",\"BBDA\",IF(E5=\"Citibank (Trinidad & Tobago) Limited\",\"CITI\",IF(E5=\"FirstCaribbean International Bank (Trinidad & Tobago) Limited \",\"FCIB\",IF(E5=\"First Citizens Bank Limited \",\"FCB\",IF(E5=\"JMMB Bank (T&T) Limited \",\"ICBL\",IF(E5=\"RBC Royal Bank (Trinidad and Tobago) Limited\",\"RBTT\",IF(E5=\"Republic Bank Limited \",\"RBL\",IF(E5=\"Scotiabank Trinidad and Tobago Limited \",\"BNS\",\"\"))))))))","v":""}]
[null,"Period:",{"$f":"CONCATENATE('COVER PAGE'!F9,\" \",'COVER PAGE'!F10)","v":"Select Month Select Year"}]
[]
[null,null,"(TT$'000s)"]
["  ","      ","0-1 Mth",">1-3 Mths",">3-6 Mths",">6-12 Mths",">1-3 Yrs",">3-5 Yrs",">5-10 Yrs",">10-15 Yrs",">15-20 Yrs",">20 Yrs","Assumptions"]
[null,"Assets"]
[11,"Liquid Funds"]
[11.1,"Cash"]
[11.2,"Reserves"]
[11.3,"Other Deposits at Central Bank"]
[11.4,"Other Liquid Funds"]
[12,"Interbank Funds Sold"]
[13,"Investments"]
[13.1,"Fixed Rate"]
[13.2,"Floating Rate"]
[14,"Loans"]
{"$rows_left_out":32}
{"sheet":"Maturity","index":4,"n_rows":51,"n_cols":12,"rows_kept":51,"cut":false,"hidden":false,"merged":[[4,2,4,6],[7,2,7,10],[1,0,1,11],[3,2,3,6],[5,2,5,6]]}
[]
["Asset and Liability Maturity Schedule\n- Interest Rate Risk -"]
[]
[null,"Name of Institution:",{"$f":"'COVER PAGE'!C7","v":"        Select Institution"}]
[null,"Institution Code:",{"$f":"IF(C4=\"ANSA Bank Limited\",\"BBDA\",IF(C4=\"Citibank (Trinidad & Tobago) Limited\",\"CITI\",IF(C4=\"CIBC Caribbean Bank (Trinidad and Tobago) Limited \",\"FCIB\",IF(C4=\"First Citizens Bank Limited \",\"FCB\",IF(C4=\"JMMB Bank (T&T) Limited \",\"ICBL\",IF(C4=\"RBC Royal Bank (Trinidad and Tobago) Limited\",\"RBTT\",IF(C4=\"Republic Bank Limited \",\"RBL\",IF(C4=\"Scotiabank Trinidad and Tobago Limited \",\"BNS\",\"\"))))))))","v":""},{"$f":"IF(B5=\"ANSA Bank Limited\",\"BBDA\",IF(B5=\"Citibank (Trinidad & Tobago) Limited\",\"CITI\",IF(B5=\"FirstCaribbean International Bank (Trinidad & Tobago) Limited \",\"FCIB\",IF(B5=\"First Citizens Bank Limited \",\"FCB\",IF(B5=\"JMMB Bank (T&T) Limited \",\"ICBL\",IF(B5=\"RBC Royal Bank (Trinidad and Tobago) Limited\",\"RBTT\",IF(B5=\"Republic Bank Limited \",\"RBL\",IF(B5=\"Scotiabank Trinidad and Tobago Limited \",\"BNS\",\"\"))))))))","v":""},{"$f":"IF(C5=\"ANSA Bank Limited\",\"BBDA\",IF(C5=\"Citibank (Trinidad & Tobago) Limited\",\"CITI\",IF(C5=\"FirstCaribbean International Bank (Trinidad & Tobago) Limited \",\"FCIB\",IF(C5=\"First Citizens Bank Limited \",\"FCB\",IF(C5=\"JMMB Bank (T&T) Limited \",\"ICBL\",IF(C5=\"RBC Royal Bank (Trinidad and Tobago) Limited\",\"RBTT\",IF(C5=\"Republic Bank Limited \",\"RBL\",IF(C5=\"Scotiabank Trinidad and Tobago Limited \",\"BNS\",\"\"))))))))","v":""},{"$f":"IF(D5=\"ANSA Bank Limited\",\"BBDA\",IF(D5=\"Citibank (Trinidad & Tobago) Limited\",\"CITI\",IF(D5=\"FirstCaribbean International Bank (Trinidad & Tobago) Limited \",\"FCIB\",IF(D5=\"First Citizens Bank Limited \",\"FCB\",IF(D5=\"JMMB Bank (T&T) Limited \",\"ICBL\",IF(D5=\"RBC Royal Bank (Trinidad and Tobago) Limited\",\"RBTT\",IF(D5=\"Republic Bank Limited \",\"RBL\",IF(D5=\"Scotiabank Trinidad and Tobago Limited \",\"BNS\",\"\"))))))))","v":""},{"$f":"IF(E5=\"ANSA Bank Limited\",\"BBDA\",IF(E5=\"Citibank (Trinidad & Tobago) Limited\",\"CITI\",IF(E5=\"FirstCaribbean International Bank (Trinidad & Tobago) Limited \",\"FCIB\",IF(E5=\"First Citizens Bank Limited \",\"FCB\",IF(E5=\"JMMB Bank (T&T) Limited \",\"ICBL\",IF(E5=\"RBC Royal Bank (Trinidad and Tobago) Limited\",\"RBTT\",IF(E5=\"Republic Bank Limited \",\"RBL\",IF(E5=\"Scotiabank Trinidad and Tobago Limited \",\"BNS\",\"\"))))))))","v":""}]
[null,"Period:",{"$f":"CONCATENATE('COVER PAGE'!F9,\" \",'COVER PAGE'!F10)","v":"Select Month Select Year"}]
[]
[null,null,"(TT$'000s)"]
["  ","      ","1-7 Days","8-14 Days","15-30 Days","31-60 Days","61-90 Days","91-180 Days","181-270 Days","271-365 Days","> 1 Year","Assumptions"]
[null,"Assets"]
[11,"Liquid Funds"]
[11.1,"Cash"]
[11.2,"Reserves"]
[11.3,"Other Deposits at Central Bank"]
[11.4,"Other Liquid Funds"]
[12,"Interbank Funds Sold"]
[13,"Investments"]
[13.1,"Fixed Rate"]
[13.2,"Floating Rate"]
[14,"Loans"]
{"$rows_left_out":32}
{"sheet":"Private Sector PDLs by Sector","index":5,"n_rows":86,"n_cols":9,"rows_kept":86,"cut":false,"hidden":false,"merged":[[3,2,3,6],[68,2,68,6],[1,0,1,8],[71,0,71,1],[4,2,4,6],[69,2,69,6],[5,2,5,6],[67,2,67,6],[7,2,7,8],[65,0,65,8],[71,2,71,8],[7,0,7,1]]}
[]
["                       Private Sector: Past Due Loans by Activity Sector"]
[]
[null,"Name of Institution:",{"$f":"'COVER PAGE'!C7","v":"        Select Institution"}]
[null,"Institution Code:",{"$f":"IF(C4=\"ANSA Bank Limited\",\"BBDA\",IF(C4=\"Citibank (Trinidad & Tobago) Limited\",\"CITI\",IF(C4=\"CIBC Caribbean Bank (Trinidad and Tobago) Limited \",\"FCIB\",IF(C4=\"First Citizens Bank Limited \",\"FCB\",IF(C4=\"JMMB Bank (T&T) Limited \",\"ICBL\",IF(C4=\"RBC Royal Bank (Trinidad and Tobago) Limited\",\"RBTT\",IF(C4=\"Republic Bank Limited \",\"RBL\",IF(C4=\"Scotiabank Trinidad and Tobago Limited \",\"BNS\",\"\"))))))))","v":""},{"$f":"IF(B5=\"ANSA Bank Limited\",\"BBDA\",IF(B5=\"Citibank (Trinidad & Tobago) Limited\",\"CITI\",IF(B5=\"FirstCaribbean International Bank (Trinidad & Tobago) Limited \",\"FCIB\",IF(B5=\"First Citizens Bank Limited \",\"FCB\",IF(B5=\"JMMB Bank (T&T) Limited \",\"ICBL\",IF(B5=\"RBC Royal Bank (Trinidad and Tobago) Limited\",\"RBTT\",IF(B5=\"Republic Bank Limited \",\"RBL\",IF(B5=\"Scotiabank Trinidad and Tobago Limited \",\"BNS\",\"\"))))))))","v":""},{"$f":"IF(C5=\"ANSA Bank Limited\",\"BBDA\",IF(C5=\"Citibank (Trinidad & Tobago) Limited\",\"CITI\",IF(C5=\"FirstCaribbean International Bank (Trinidad & Tobago) Limited \",\"FCIB\",IF(C5=\"First Citizens Bank Limited \",\"FCB\",IF(C5=\"JMMB Bank (T&T) Limited \",\"ICBL\",IF(C5=\"RBC Royal Bank (Trinidad and Tobago) Limited\",\"RBTT\",IF(C5=\"Republic Bank Limited \",\"RBL\",IF(C5=\"Scotiabank Trinidad and Tobago Limited \",\"BNS\",\"\"))))))))","v":""},{"$f":"IF(D5=\"ANSA Bank Limited\",\"BBDA\",IF(D5=\"Citibank (Trinidad & Tobago) Limited\",\"CITI\",IF(D5=\"FirstCaribbean International Bank (Trinidad & Tobago) Limited \",\"FCIB\",IF(D5=\"First Citizens Bank Limited \",\"FCB\",IF(D5=\"JMMB Bank (T&T) Limited \",\"ICBL\",IF(D5=\"RBC Royal Bank (Trinidad and Tobago) Limited\",\"RBTT\",IF(D5=\"Republic Bank Limited \",\"RBL\",IF(D5=\"Scotiabank Trinidad and Tobago Limited \",\"BNS\",\"\"))))))))","v":""},{"$f":"IF(E5=\"ANSA Bank Limited\",\"BBDA\",IF(E5=\"Citibank (Trinidad & Tobago) Limited\",\"CITI\",IF(E5=\"FirstCaribbean International Bank (Trinidad & Tobago) Limited \",\"FCIB\",IF(E5=\"First Citizens Bank Limited \",\"FCB\",IF(E5=\"JMMB Bank (T&T) Limited \",\"ICBL\",IF(E5=\"RBC Royal Bank (Trinidad and Tobago) Limited\",\"RBTT\",IF(E5=\"Republic Bank Limited \",\"RBL\",IF(E5=\"Scotiabank Trinidad and Tobago Limited \",\"BNS\",\"\"))))))))","v":""}]
[null,"Period:",{"$f":"CONCATENATE('COVER PAGE'!F9,\" \",'COVER PAGE'!F10)","v":"Select Month Select Year"}]
[]
[null,null,"(TT$000s)"]
["  ","Business Purpose","Current","1 Mth",">1-3 Mths",">3-6 Mths",">6-12 Mths",">12-24 Mths",">24 Mths"]
[1,"Cocoa, Coffee, Citrus Cultivation"]
[2,"Coconut Growing"]
[3,"Rootcrops, Pulses, Vegetables, Tobacco, Rice"]
[4,"Poultry and Eggs"]
[5,"Dairy, Beef, Pork and Other Meat"]
[6,"Forestry and Fishing"]
[7,"Other Domestic Agriculture"]
[8,"Sugar Industry"]
[9,"Petroleum (Including Petrochemicals and Asphalt"]
[10,"Food Processors"]
[11,"Drink and Tobacco Processors"]
{"$rows_left_out":67}
{"sheet":"Public Sector PDLs by Sector","index":6,"n_rows":86,"n_cols":9,"rows_kept":86,"cut":false,"hidden":false,"merged":[[4,2,4,6],[3,2,3,6],[1,0,1,8],[7,0,7,1],[69,2,69,6],[5,2,5,6],[7,2,7,8],[71,0,71,1],[71,2,71,8],[68,2,68,6],[67,2,67,6],[65,0,65,8]]}
[]
["                       Public Sector: Past Due Loans by Activity Sector"]
[]
[null,"Name of Institution:",{"$f":"'COVER PAGE'!C7","v":"        Select Institution"}]
[null,"Institution Code:",{"$f":"IF(C4=\"ANSA Bank Limited\",\"BBDA\",IF(C4=\"Citibank (Trinidad & Tobago) Limited\",\"CITI\",IF(C4=\"CIBC Caribbean Bank (Trinidad and Tobago) Limited \",\"FCIB\",IF(C4=\"First Citizens Bank Limited \",\"FCB\",IF(C4=\"JMMB Bank (T&T) Limited \",\"ICBL\",IF(C4=\"RBC Royal Bank (Trinidad and Tobago) Limited\",\"RBTT\",IF(C4=\"Republic Bank Limited \",\"RBL\",IF(C4=\"Scotiabank Trinidad and Tobago Limited \",\"BNS\",\"\"))))))))","v":""},{"$f":"IF(B5=\"ANSA Bank Limited\",\"BBDA\",IF(B5=\"Citibank (Trinidad & Tobago) Limited\",\"CITI\",IF(B5=\"FirstCaribbean International Bank (Trinidad & Tobago) Limited \",\"FCIB\",IF(B5=\"First Citizens Bank Limited \",\"FCB\",IF(B5=\"JMMB Bank (T&T) Limited \",\"ICBL\",IF(B5=\"RBC Royal Bank (Trinidad and Tobago) Limited\",\"RBTT\",IF(B5=\"Republic Bank Limited \",\"RBL\",IF(B5=\"Scotiabank Trinidad and Tobago Limited \",\"BNS\",\"\"))))))))","v":""},{"$f":"IF(C5=\"ANSA Bank Limited\",\"BBDA\",IF(C5=\"Citibank (Trinidad & Tobago) Limited\",\"CITI\",IF(C5=\"FirstCaribbean International Bank (Trinidad & Tobago) Limited \",\"FCIB\",IF(C5=\"First Citizens Bank Limited \",\"FCB\",IF(C5=\"JMMB Bank (T&T) Limited \",\"ICBL\",IF(C5=\"RBC Royal Bank (Trinidad and Tobago) Limited\",\"RBTT\",IF(C5=\"Republic Bank Limited \",\"RBL\",IF(C5=\"Scotiabank Trinidad and Tobago Limited \",\"BNS\",\"\"))))))))","v":""},{"$f":"IF(D5=\"ANSA Bank Limited\",\"BBDA\",IF(D5=\"Citibank (Trinidad & Tobago) Limited\",\"CITI\",IF(D5=\"FirstCaribbean International Bank (Trinidad & Tobago) Limited \",\"FCIB\",IF(D5=\"First Citizens Bank Limited \",\"FCB\",IF(D5=\"JMMB Bank (T&T) Limited \",\"ICBL\",IF(D5=\"RBC Royal Bank (Trinidad and Tobago) Limited\",\"RBTT\",IF(D5=\"Republic Bank Limited \",\"RBL\",IF(D5=\"Scotiabank Trinidad and Tobago Limited \",\"BNS\",\"\"))))))))","v":""},{"$f":"IF(E5=\"ANSA Bank Limited\",\"BBDA\",IF(E5=\"Citibank (Trinidad & Tobago) Limited\",\"CITI\",IF(E5=\"FirstCaribbean International Bank (Trinidad & Tobago) Limited \",\"FCIB\",IF(E5=\"First Citizens Bank Limited \",\"FCB\",IF(E5=\"JMMB Bank (T&T) Limited \",\"ICBL\",IF(E5=\"RBC Royal Bank (Trinidad and Tobago) Limited\",\"RBTT\",IF(E5=\"Republic Bank Limited \",\"RBL\",IF(E5=\"Scotiabank Trinidad and Tobago Limited \",\"BNS\",\"\"))))))))","v":""}]
[null,"Period:",{"$f":"CONCATENATE('COVER PAGE'!F9,\" \",'COVER PAGE'!F10)","v":"Select Month Select Year"}]
[]
[null,null,"(TT$000s)"]
["  ","Business Purpose","Current","1 Mth",">1-3 Mths",">3-6 Mths",">6-12 Mths",">12-24 Mths",">24 Mths"]
[1,"Cocoa, Coffee, Citrus Cultivation"]
[2,"Coconut Growing"]
[3,"Rootcrops, Pulses, Vegetables, Tobacco, Rice"]
[4,"Poultry and Eggs"]
[5,"Dairy, Beef, Pork and Other Meat"]
[6,"Forestry and Fishing"]
[7,"Other Domestic Agriculture"]
[8,"Sugar Industry"]
[9,"Petroleum (Including Petrochemicals and Asphalt"]
[10,"Food Processors"]
[11,"Drink and Tobacco Processors"]
{"$rows_left_out":67}
{"sheet":"Consumer PDLs by Purpose","index":7,"n_rows":31,"n_cols":9,"rows_kept":31,"cut":false,"hidden":false,"merged":[[7,0,7,1],[3,2,3,6],[1,0,1,8],[5,2,5,6],[7,2,7,8],[4,2,4,6]]}
[]
["                       Consumers: Past Due Loans by Purpose"]
[]
[null,"Name of Institution:",{"$f":"'COVER PAGE'!C7","v":"        Select Institution"}]
[null,"Institution Code:",{"$f":"IF(C4=\"ANSA Bank Limited\",\"BBDA\",IF(C4=\"Citibank (Trinidad & Tobago) Limited\",\"CITI\",IF(C4=\"CIBC Caribbean Bank (Trinidad and Tobago) Limited \",\"FCIB\",IF(C4=\"First Citizens Bank Limited \",\"FCB\",IF(C4=\"JMMB Bank (T&T) Limited \",\"ICBL\",IF(C4=\"RBC Royal Bank (Trinidad and Tobago) Limited\",\"RBTT\",IF(C4=\"Republic Bank Limited \",\"RBL\",IF(C4=\"Scotiabank Trinidad and Tobago Limited \",\"BNS\",\"\"))))))))","v":""},{"$f":"IF(B5=\"ANSA Bank Limited\",\"BBDA\",IF(B5=\"Citibank (Trinidad & Tobago) Limited\",\"CITI\",IF(B5=\"FirstCaribbean International Bank (Trinidad & Tobago) Limited \",\"FCIB\",IF(B5=\"First Citizens Bank Limited \",\"FCB\",IF(B5=\"JMMB Bank (T&T) Limited \",\"ICBL\",IF(B5=\"RBC Royal Bank (Trinidad and Tobago) Limited\",\"RBTT\",IF(B5=\"Republic Bank Limited \",\"RBL\",IF(B5=\"Scotiabank Trinidad and Tobago Limited \",\"BNS\",\"\"))))))))","v":""},{"$f":"IF(C5=\"ANSA Bank Limited\",\"BBDA\",IF(C5=\"Citibank (Trinidad & Tobago) Limited\",\"CITI\",IF(C5=\"FirstCaribbean International Bank (Trinidad & Tobago) Limited \",\"FCIB\",IF(C5=\"First Citizens Bank Limited \",\"FCB\",IF(C5=\"JMMB Bank (T&T) Limited \",\"ICBL\",IF(C5=\"RBC Royal Bank (Trinidad and Tobago) Limited\",\"RBTT\",IF(C5=\"Republic Bank Limited \",\"RBL\",IF(C5=\"Scotiabank Trinidad and Tobago Limited \",\"BNS\",\"\"))))))))","v":""},{"$f":"IF(D5=\"ANSA Bank Limited\",\"BBDA\",IF(D5=\"Citibank (Trinidad & Tobago) Limited\",\"CITI\",IF(D5=\"FirstCaribbean International Bank (Trinidad & Tobago) Limited \",\"FCIB\",IF(D5=\"First Citizens Bank Limited \",\"FCB\",IF(D5=\"JMMB Bank (T&T) Limited \",\"ICBL\",IF(D5=\"RBC Royal Bank (Trinidad and Tobago) Limited\",\"RBTT\",IF(D5=\"Republic Bank Limited \",\"RBL\",IF(D5=\"Scotiabank Trinidad and Tobago Limited \",\"BNS\",\"\"))))))))","v":""},{"$f":"IF(E5=\"ANSA Bank Limited\",\"BBDA\",IF(E5=\"Citibank (Trinidad & Tobago) Limited\",\"CITI\",IF(E5=\"FirstCaribbean International Bank (Trinidad & Tobago) Limited \",\"FCIB\",IF(E5=\"First Citizens Bank Limited \",\"FCB\",IF(E5=\"JMMB Bank (T&T) Limited \",\"ICBL\",IF(E5=\"RBC Royal Bank (Trinidad and Tobago) Limited\",\"RBTT\",IF(E5=\"Republic Bank Limited \",\"RBL\",IF(E5=\"Scotiabank Trinidad and Tobago Limited \",\"BNS\",\"\"))))))))","v":""}]
[null,"Period:",{"$f":"CONCATENATE('COVER PAGE'!F9,\" \",'COVER PAGE'!F10)","v":"Select Month Select Year"}]
[]
[null,null,"(TT$000s)"]
["  ","Consumer Purpose","Current","1 Mth",">1-3 Mths",">3-6 Mths",">6-12 Mths",">12-24 Mths",">24 Mths"]
[1,"Bridging Finance"]
[2,"Land and Real Estate"]
[3,"Home Improvement/Renovation"]
[4,"Private Cars - New"]
[5,"Private Cars - Used"]
[6,"Other vehicles"]
[7,"Electrical/Non - Electrical Domestic Appliances"]
[8,"Radios, Musical Instruments, etc."]
[9,"Other Furniture, Furnishings"]
[10,"Purchase of New Shares"]
[11,"Purchase of Other Financial Assets"]
{"$rows_left_out":12}
{"sheet":"ascii","index":8,"n_rows":1505,"n_cols":4,"rows_kept":1505,"cut":false,"hidden":true,"merged":[]}
["DATE",{"$f":"TEXT(CONCATENATE('COVER PAGE'!F9,\" \",'COVER PAGE'!F10),\"mmmyy\")","v":"Select Month Select Year"},"FREQ","Q"]
["SERIESNAME",{"$f":"VLOOKUP('COVER PAGE'!C7,Codes!A1:B9,2,)","v":"xxx"}]
[".11.INTRATE.0_1MTH.ALL",{"$f":"'Repricing&Maturity'!$C$11","v":0}]
[".11.INTRATE.OVR1_3MTHS.ALL",{"$f":"'Repricing&Maturity'!$D$11","v":0}]
[".11.INTRATE.OVR3_6MTHS.ALL ",{"$f":"'Repricing&Maturity'!$E$11","v":0}]
[".11.INTRATE.OVR6_12MTHS.ALL ",{"$f":"'Repricing&Maturity'!$F$11","v":0}]
[".11.INTRATE.OVR1_3YRS.ALL ",{"$f":"'Repricing&Maturity'!$G$11","v":0}]
[".11.INTRATE.OVR3YRS_5YRS.ALL ",{"$f":"'Repricing&Maturity'!$H$11","v":0}]
[".11.INTRATE.OVR5YRS_10YRS.ALL ",{"$f":"'Repricing&Maturity'!$I$11","v":0}]
[".11.INTRATE.OVR10_15YRS.ALL ",{"$f":"'Repricing&Maturity'!$J$11","v":0}]
[".11.INTRATE.OVR15YRS_20YRS.ALL ",{"$f":"'Repricing&Maturity'!$K$11","v":0}]
[".11.INTRATE.OVR20YRS.ALL ",{"$f":"'Repricing&Maturity'!$L$11","v":0}]
[".1101.INTRATE.0_1MTH.ALL ",{"$f":"'Repricing&Maturity'!C12","v":0}]
[".1101.INTRATE.OVR1_3MTHS.ALL",{"$f":"'Repricing&Maturity'!$D$12","v":0}]
[".1101.INTRATE.OVR3_6MTHS.ALL ",{"$f":"'Repricing&Maturity'!$E$12","v":0}]
[".1101.INTRATE.OVR6_12MTHS.ALL ",{"$f":"'Repricing&Maturity'!$F$12","v":0}]
[".1101.INTRATE.OVR1_3YRS.ALL ",{"$f":"'Repricing&Maturity'!$G$12","v":0}]
[".1101.INTRATE.OVR3YRS_5YRS.ALL ",{"$f":"'Repricing&Maturity'!$H$12","v":0}]
[".1101.INTRATE.OVR5YRS_10YRS.ALL ",{"$f":"'Repricing&Maturity'!$I$12","v":0}]
[".1101.INTRATE.OVR10_15YRS.ALL ",{"$f":"'Repricing&Maturity'!$J$12","v":0}]
{"$rows_left_out":1486}
{"sheet":"Codes","index":9,"n_rows":32,"n_cols":5,"rows_kept":32,"cut":false,"hidden":true,"merged":[]}
["        Select Institution","xxx",null,"Select Year","Select Month"]
["ANSA Bank Limited","BBDA",null,"2020","March"]
["Citibank (Trinidad & Tobago) Limited","CITI",null,"2021","June"]
["First Citizens Bank Limited ","FCB",null,"2022","September"]
["CIBC Caribbean Bank (Trinidad and Tobago) Limited ","FCIB",null,"2023","December"]
["JMMB Bank (T&T) Limited ","ICBL",null,"2024"]
["RBC Royal Bank (Trinidad and Tobago) Limited","RBTT",null,"2025"]
["Republic Bank Limited ","RBL",null,"2026"]
["Scotiabank Trinidad and Tobago Limited ","BNS",null,"2027"]
[null,null,null,"2028"]
[null,null,null,"2029"]
[null,null,null,"2030"]
[null,null,null,"2031"]
[null,null,null,"2032"]
[null,null,null,"2033"]
[null,null,null,"2034"]
[null,null,null,"2035"]
[null,null,null,"2036"]
[null,null,null,"2037"]
[null,null,null,"2038"]
{"$rows_left_out":13}
{"sheet":"SIGNATURE ","index":10,"n_rows":31,"n_cols":4,"rows_kept":31,"cut":false,"hidden":false,"merged":[]}
[]
[]
[]
[]
[]
[null,"Name of Person Completing Form ",null,"Signature of Person Completing Form "]
[null,"(Block Letters)"]
[]
[]
[]
[]
[null,"Name of Authorised Official ",null,"Signature of Authorised Official "]
[null,"(Block Letters)"]
[]
[]
[]
[]
[null,"Position/Office Held ",null,"Date"]
[null,"(Place Company Stamp)"]
[]
{"$rows_left_out":11}